{"text_format":"1","workbook":"xlsx","n_sheets":3,"sheets":["List1","List2","List3"],"not_rendered":{"charts":0,"images":0,"macros":1,"external_links":0,"defined_names":2,"comments":0,"pivot_tables":0},"unopened":[],"bounds":{"document_bytes":16777216,"sheet_cells":100000,"rows_first":2000,"rows_last":500,"rows_between":2000,"halvings":0,"cell_chars":16384,"cell_head_chars":4096},"cells_cut":0,"cells_raw":0,"read":"whole","date_system":"1900"}

{"sheet":"List1","index":0,"n_rows":101,"n_cols":42,"rows_kept":101,"cut":false,"hidden":false,"merged":[[0,6,0,7],[0,8,0,9],[0,10,0,11],[0,1,1,1],[0,2,1,2],[0,3,1,3],[0,32,0,33],[0,34,0,35],[0,36,0,37],[0,38,0,39],[0,0,1,0],[0,22,0,23],[0,24,0,25],[0,26,0,27],[0,28,0,29],[0,30,0,31],[0,12,0,13],[0,14,0,15],[0,16,0,17],[0,18,0,19],[0,20,0,21],[0,4,0,5]]}
["Pořadí","Jméno","Body\n8 nej","Body\ncelkem","1. \nNAMCC\n6.5.",null,"UNO 11.6",null,"Hrádek",null,"L.Boh.",null,"Na Vrších",null,"Osyčina",null,"Sv.Hamry",null,"Svratka",null,"9.",null,"10.",null,"11.",null,"12.",null,"13.",null,"14.",null,"15.",null,"16.",null,"17.",null,"18.",null,null,"Setřídit: Ctrl+Shift+S"]
[null,null,null,null,"Poř.","Body","Poř.","Body","Poř.","Body","Poř.","Body","Poř.","Body","Poř.","Body","Poř.","Body","Poř.","Body","Poř.","Body","Poř.","Body","Poř.","Body","Poř.","Body","Poř.","Body","Poř.","Body","Poř.","Body","Poř.","Body","Poř.","Body","Poř.","Body"]
[{"$f":"IF(ISBLANK(B3),\"\",1)","v":1},"Stránský Bohumil",{"$f":"IF(IFERROR(LARGE(F3:AN3,1),0)+IFERROR(LARGE(F3:AN3,2),0)+IFERROR(LARGE(F3:AN3,3),0)+IFERROR(LARGE(F3:AN3,4),0)+IFERROR(LARGE(F3:AN3,5),0)+IFERROR(LARGE(F3:AN3,6),0)+IFERROR(LARGE(F3:AN3,7),0)++IFERROR(LARGE(F3:AN3,8),0)=0,\"\",IFERROR(LARGE(F3:AN3,1),0)+IFERROR(LARGE(F3:AN3,2),0)+IFERROR(LARGE(F3:AN3,3),0)+IFERROR(LARGE(F3:AN3,4),0)+IFERROR(LARGE(F3:AN3,5),0)+IFERROR(LARGE(F3:AN3,6),0)+IFERROR(LARGE(F3:AN3,7),0)+IFERROR(LARGE(F3:AND3,8),0))","v":200},{"$f":"IF(SUM(F3,H3,J3,L3,N3,P3,R3,T3,V3,X3,Z3,AB3,AD3,AF3,AH3,AJ3,AL3,AN3)=0,\"\",SUM(F3,H3,J3,L3,N3,P3,R3,T3,V3,X3,Z3,AB3,AD3,AF3,AH3,AJ3,AL3,AN3))","v":200},"1",{"$f":"IF(ISBLANK(E3),\"\",IF(VALUE(E3)>89,1,VLOOKUP(VALUE(E3),List2!$A$1:'List2'!$B$90,2)))","v":200},null,{"$f":"IF(ISBLANK(G3),\"\",IF(VALUE(G3)>89,1,VLOOKUP(VALUE(G3),List2!$A$1:'List2'!$B$90,2)))","v":""},null,{"$f":"IF(ISBLANK(I3),\"\",IF(VALUE(I3)>89,1,VLOOKUP(VALUE(I3),List2!$A$1:'List2'!$B$90,2)))","v":""},null,{"$f":"IF(ISBLANK(K3),\"\",IF(VALUE(K3)>89,1,VLOOKUP(VALUE(K3),List2!$A$1:'List2'!$B$90,2)))","v":""},null,{"$f":"IF(ISBLANK(M3),\"\",IF(VALUE(M3)>89,1,VLOOKUP(VALUE(M3),List2!$A$1:'List2'!$B$90,2)))","v":""},null,{"$f":"IF(ISBLANK(O3),\"\",IF(VALUE(O3)>89,1,VLOOKUP(VALUE(O3),List2!$A$1:'List2'!$B$90,2)))","v":""},null,{"$f":"IF(ISBLANK(Q3),\"\",IF(VALUE(Q3)>89,1,VLOOKUP(VALUE(Q3),List2!$A$1:'List2'!$B$90,2)))","v":""},null,{"$f":"IF(ISBLANK(S3),\"\",IF(VALUE(S3)>89,1,VLOOKUP(VALUE(S3),List2!$A$1:'List2'!$B$90,2)))","v":""},null,{"$f":"IF(ISBLANK(U3),\"\",IF(VALUE(U3)>89,1,VLOOKUP(VALUE(U3),List2!$A$1:'List2'!$B$90,2)))","v":""},null,{"$f":"IF(ISBLANK(W3),\"\",IF(VALUE(W3)>89,1,VLOOKUP(VALUE(W3),List2!$A$1:'List2'!$B$90,2)))","v":""},null,{"$f":"IF(ISBLANK(Y3),\"\",IF(VALUE(Y3)>89,1,VLOOKUP(VALUE(Y3),List2!$A$1:'List2'!$B$90,2)))","v":""},null,{"$f":"IF(ISBLANK(AA3),\"\",IF(VALUE(AA3)>89,1,VLOOKUP(VALUE(AA3),List2!$A$1:'List2'!$B$90,2)))","v":""},null,{"$f":"IF(ISBLANK(AC3),\"\",IF(VALUE(AC3)>89,1,VLOOKUP(VALUE(AC3),List2!$A$1:'List2'!$B$90,2)))","v":""},null,{"$f":"IF(ISBLANK(AE3),\"\",IF(VALUE(AE3)>89,1,VLOOKUP(VALUE(AE3),List2!$A$1:'List2'!$B$90,2)))","v":""},null,{"$f":"IF(ISBLANK(AG3),\"\",IF(VALUE(AG3)>89,1,VLOOKUP(VALUE(AG3),List2!$A$1:'List2'!$B$90,2)))","v":""},null,{"$f":"IF(ISBLANK(AI3),\"\",IF(VALUE(AI3)>89,1,VLOOKUP(VALUE(AI3),List2!$A$1:'List2'!$B$90,2)))","v":""},null,{"$f":"IF(ISBLANK(AK3),\"\",IF(VALUE(AK3)>89,1,VLOOKUP(VALUE(AK3),List2!$A$1:'List2'!$B$90,2)))","v":""},null,{"$f":"IF(ISBLANK(AM3),\"\",IF(VALUE(AM3)>89,1,VLOOKUP(VALUE(AM3),List2!$A$1:'List2'!$B$90,2)))","v":""},null,{"$f":"IFERROR(LARGE(F3:AN3,1),0)+IFERROR(LARGE(F3:AN3,2),0)+IFERROR(LARGE(F3:AN3,3),0)+IFERROR(LARGE(F3:AN3,4),0)+IFERROR(LARGE(F3:AN3,5),0)+IFERROR(LARGE(F3:AN3,6),0)+IFERROR(LARGE(F3:AN3,7),0)+IFERROR(LARGE(F3:AN3,8),0)","v":200}]
[{"$f":"IF(OR(ISBLANK(B4),A3=\"\"),\"\",A3+1)","v":2},"Tomeš Jiří",350,350,"2",{"$f":"IF(ISBLANK(E4),\"\",IF(VALUE(E4)>89,1,VLOOKUP(VALUE(E4),List2!$A$1:'List2'!$B$90,2)))","v":180},"3",{"$f":"IF(ISBLANK(G4),\"\",IF(VALUE(G4)>89,1,VLOOKUP(VALUE(G4),List2!$A$1:'List2'!$B$90,2)))","v":170},null,{"$f":"IF(ISBLANK(I4),\"\",IF(VALUE(I4)>89,1,VLOOKUP(VALUE(I4),List2!$A$1:'List2'!$B$90,2)))","v":""},null,{"$f":"IF(ISBLANK(K4),\"\",IF(VALUE(K4)>89,1,VLOOKUP(VALUE(K4),List2!$A$1:'List2'!$B$90,2)))","v":""},null,{"$f":"IF(ISBLANK(M4),\"\",IF(VALUE(M4)>89,1,VLOOKUP(VALUE(M4),List2!$A$1:'List2'!$B$90,2)))","v":""},null,{"$f":"IF(ISBLANK(O4),\"\",IF(VALUE(O4)>89,1,VLOOKUP(VALUE(O4),List2!$A$1:'List2'!$B$90,2)))","v":""},null,{"$f":"IF(ISBLANK(Q4),\"\",IF(VALUE(Q4)>89,1,VLOOKUP(VALUE(Q4),List2!$A$1:'List2'!$B$90,2)))","v":""},null,{"$f":"IF(ISBLANK(S4),\"\",IF(VALUE(S4)>89,1,VLOOKUP(VALUE(S4),List2!$A$1:'List2'!$B$90,2)))","v":""},null,{"$f":"IF(ISBLANK(U4),\"\",IF(VALUE(U4)>89,1,VLOOKUP(VALUE(U4),List2!$A$1:'List2'!$B$90,2)))","v":""},null,{"$f":"IF(ISBLANK(W4),\"\",IF(VALUE(W4)>89,1,VLOOKUP(VALUE(W4),List2!$A$1:'List2'!$B$90,2)))","v":""},null,{"$f":"IF(ISBLANK(Y4),\"\",IF(VALUE(Y4)>89,1,VLOOKUP(VALUE(Y4),List2!$A$1:'List2'!$B$90,2)))","v":""},null,{"$f":"IF(ISBLANK(AA4),\"\",IF(VALUE(AA4)>89,1,VLOOKUP(VALUE(AA4),List2!$A$1:'List2'!$B$90,2)))","v":""},null,{"$f":"IF(ISBLANK(AC4),\"\",IF(VALUE(AC4)>89,1,VLOOKUP(VALUE(AC4),List2!$A$1:'List2'!$B$90,2)))","v":""},null,{"$f":"IF(ISBLANK(AE4),\"\",IF(VALUE(AE4)>89,1,VLOOKUP(VALUE(AE4),List2!$A$1:'List2'!$B$90,2)))","v":""},null,{"$f":"IF(ISBLANK(AG4),\"\",IF(VALUE(AG4)>89,1,VLOOKUP(VALUE(AG4),List2!$A$1:'List2'!$B$90,2)))","v":""},null,{"$f":"IF(ISBLANK(AI4),\"\",IF(VALUE(AI4)>89,1,VLOOKUP(VALUE(AI4),List2!$A$1:'List2'!$B$90,2)))","v":""},null,{"$f":"IF(ISBLANK(AK4),\"\",IF(VALUE(AK4)>89,1,VLOOKUP(VALUE(AK4),List2!$A$1:'List2'!$B$90,2)))","v":""},null,{"$f":"IF(ISBLANK(AM4),\"\",IF(VALUE(AM4)>89,1,VLOOKUP(VALUE(AM4),List2!$A$1:'List2'!$B$90,2)))","v":""},null,350]
[{"$f":"IF(OR(ISBLANK(B5),A4=\"\"),\"\",A4+1)","v":3},"Sládek František",952,952,"3",{"$f":"IF(ISBLANK(E5),\"\",IF(VALUE(E5)>89,1,VLOOKUP(VALUE(E5),List2!$A$1:'List2'!$B$90,2)))","v":170},"4",{"$f":"IF(ISBLANK(G5),\"\",IF(VALUE(G5)>89,1,VLOOKUP(VALUE(G5),List2!$A$1:'List2'!$B$90,2)))","v":162},"5",{"$f":"IF(ISBLANK(I5),\"\",IF(VALUE(I5)>89,1,VLOOKUP(VALUE(I5),List2!$A$1:'List2'!$B$90,2)))","v":156},"1",{"$f":"IF(ISBLANK(K5),\"\",IF(VALUE(K5)>89,1,VLOOKUP(VALUE(K5),List2!$A$1:'List2'!$B$90,2)))","v":200},null,{"$f":"IF(ISBLANK(M5),\"\",IF(VALUE(M5)>89,1,VLOOKUP(VALUE(M5),List2!$A$1:'List2'!$B$90,2)))","v":""},"9",{"$f":"IF(ISBLANK(O5),\"\",IF(VALUE(O5)>89,1,VLOOKUP(VALUE(O5),List2!$A$1:'List2'!$B$90,2)))","v":140},"14",{"$f":"IF(ISBLANK(Q5),\"\",IF(VALUE(Q5)>89,1,VLOOKUP(VALUE(Q5),List2!$A$1:'List2'!$B$90,2)))","v":124},null,{"$f":"IF(ISBLANK(S5),\"\",IF(VALUE(S5)>89,1,VLOOKUP(VALUE(S5),List2!$A$1:'List2'!$B$90,2)))","v":""},null,{"$f":"IF(ISBLANK(U5),\"\",IF(VALUE(U5)>89,1,VLOOKUP(VALUE(U5),List2!$A$1:'List2'!$B$90,2)))","v":""},null,{"$f":"IF(ISBLANK(W5),\"\",IF(VALUE(W5)>89,1,VLOOKUP(VALUE(W5),List2!$A$1:'List2'!$B$90,2)))","v":""},null,{"$f":"IF(ISBLANK(Y5),\"\",IF(VALUE(Y5)>89,1,VLOOKUP(VALUE(Y5),List2!$A$1:'List2'!$B$90,2)))","v":""},null,{"$f":"IF(ISBLANK(AA5),\"\",IF(VALUE(AA5)>89,1,VLOOKUP(VALUE(AA5),List2!$A$1:'List2'!$B$90,2)))","v":""},null,{"$f":"IF(ISBLANK(AC5),\"\",IF(VALUE(AC5)>89,1,VLOOKUP(VALUE(AC5),List2!$A$1:'List2'!$B$90,2)))","v":""},null,{"$f":"IF(ISBLANK(AE5),\"\",IF(VALUE(AE5)>89,1,VLOOKUP(VALUE(AE5),List2!$A$1:'List2'!$B$90,2)))","v":""},null,{"$f":"IF(ISBLANK(AG5),\"\",IF(VALUE(AG5)>89,1,VLOOKUP(VALUE(AG5),List2!$A$1:'List2'!$B$90,2)))","v":""},null,{"$f":"IF(ISBLANK(AI5),\"\",IF(VALUE(AI5)>89,1,VLOOKUP(VALUE(AI5),List2!$A$1:'List2'!$B$90,2)))","v":""},null,{"$f":"IF(ISBLANK(AK5),\"\",IF(VALUE(AK5)>89,1,VLOOKUP(VALUE(AK5),List2!$A$1:'List2'!$B$90,2)))","v":""},null,{"$f":"IF(ISBLANK(AM5),\"\",IF(VALUE(AM5)>89,1,VLOOKUP(VALUE(AM5),List2!$A$1:'List2'!$B$90,2)))","v":""},null,952]
[4,"Vávra Jan",1254,1251,"4",{"$f":"IF(ISBLANK(E6),\"\",IF(VALUE(E6)>89,1,VLOOKUP(VALUE(E6),List2!$A$1:'List2'!$B$90,2)))","v":162},"6",{"$f":"IF(ISBLANK(G6),\"\",IF(VALUE(G6)>89,1,VLOOKUP(VALUE(G6),List2!$A$1:'List2'!$B$90,2)))","v":152},"10",{"$f":"IF(ISBLANK(I6),\"\",IF(VALUE(I6)>89,1,VLOOKUP(VALUE(I6),List2!$A$1:'List2'!$B$90,2)))","v":136},"5",{"$f":"IF(ISBLANK(K6),\"\",IF(VALUE(K6)>89,1,VLOOKUP(VALUE(K6),List2!$A$1:'List2'!$B$90,2)))","v":156},"3",{"$f":"IF(ISBLANK(M6),\"\",IF(VALUE(M6)>89,1,VLOOKUP(VALUE(M6),List2!$A$1:'List2'!$B$90,2)))","v":170},"2",{"$f":"IF(ISBLANK(O6),\"\",IF(VALUE(O6)>89,1,VLOOKUP(VALUE(O6),List2!$A$1:'List2'!$B$90,2)))","v":180},"11",{"$f":"IF(ISBLANK(Q6),\"\",IF(VALUE(Q6)>89,1,VLOOKUP(VALUE(Q6),List2!$A$1:'List2'!$B$90,2)))","v":133},"4",{"$f":"IF(ISBLANK(S6),\"\",IF(VALUE(S6)>89,1,VLOOKUP(VALUE(S6),List2!$A$1:'List2'!$B$90,2)))","v":162},null,{"$f":"IF(ISBLANK(U6),\"\",IF(VALUE(U6)>89,1,VLOOKUP(VALUE(U6),List2!$A$1:'List2'!$B$90,2)))","v":""},null,{"$f":"IF(ISBLANK(W6),\"\",IF(VALUE(W6)>89,1,VLOOKUP(VALUE(W6),List2!$A$1:'List2'!$B$90,2)))","v":""},null,null,null,{"$f":"IF(ISBLANK(AA6),\"\",IF(VALUE(AA6)>89,1,VLOOKUP(VALUE(AA6),List2!$A$1:'List2'!$B$90,2)))","v":""},null,{"$f":"IF(ISBLANK(AC6),\"\",IF(VALUE(AC6)>89,1,VLOOKUP(VALUE(AC6),List2!$A$1:'List2'!$B$90,2)))","v":""},null,{"$f":"IF(ISBLANK(AE6),\"\",IF(VALUE(AE6)>89,1,VLOOKUP(VALUE(AE6),List2!$A$1:'List2'!$B$90,2)))","v":""},null,{"$f":"IF(ISBLANK(AG6),\"\",IF(VALUE(AG6)>89,1,VLOOKUP(VALUE(AG6),List2!$A$1:'List2'!$B$90,2)))","v":""},null,{"$f":"IF(ISBLANK(AI6),\"\",IF(VALUE(AI6)>89,1,VLOOKUP(VALUE(AI6),List2!$A$1:'List2'!$B$90,2)))","v":""},null,{"$f":"IF(ISBLANK(AK6),\"\",IF(VALUE(AK6)>89,1,VLOOKUP(VALUE(AK6),List2!$A$1:'List2'!$B$90,2)))","v":""},null,{"$f":"IF(ISBLANK(AM6),\"\",IF(VALUE(AM6)>89,1,VLOOKUP(VALUE(AM6),List2!$A$1:'List2'!$B$90,2)))","v":""},null,1251]
[5,"Klacl Pavel",292,292,"5",{"$f":"IF(ISBLANK(E7),\"\",IF(VALUE(E7)>89,1,VLOOKUP(VALUE(E7),List2!$A$1:'List2'!$B$90,2)))","v":156},"10",{"$f":"IF(ISBLANK(G7),\"\",IF(VALUE(G7)>89,1,VLOOKUP(VALUE(G7),List2!$A$1:'List2'!$B$90,2)))","v":136},null,{"$f":"IF(ISBLANK(I7),\"\",IF(VALUE(I7)>89,1,VLOOKUP(VALUE(I7),List2!$A$1:'List2'!$B$90,2)))","v":""},null,{"$f":"IF(ISBLANK(K7),\"\",IF(VALUE(K7)>89,1,VLOOKUP(VALUE(K7),List2!$A$1:'List2'!$B$90,2)))","v":""},null,{"$f":"IF(ISBLANK(M7),\"\",IF(VALUE(M7)>89,1,VLOOKUP(VALUE(M7),List2!$A$1:'List2'!$B$90,2)))","v":""},null,{"$f":"IF(ISBLANK(O7),\"\",IF(VALUE(O7)>89,1,VLOOKUP(VALUE(O7),List2!$A$1:'List2'!$B$90,2)))","v":""},null,{"$f":"IF(ISBLANK(Q7),\"\",IF(VALUE(Q7)>89,1,VLOOKUP(VALUE(Q7),List2!$A$1:'List2'!$B$90,2)))","v":""},null,{"$f":"IF(ISBLANK(S7),\"\",IF(VALUE(S7)>89,1,VLOOKUP(VALUE(S7),List2!$A$1:'List2'!$B$90,2)))","v":""},null,{"$f":"IF(ISBLANK(U7),\"\",IF(VALUE(U7)>89,1,VLOOKUP(VALUE(U7),List2!$A$1:'List2'!$B$90,2)))","v":""},null,{"$f":"IF(ISBLANK(W7),\"\",IF(VALUE(W7)>89,1,VLOOKUP(VALUE(W7),List2!$A$1:'List2'!$B$90,2)))","v":""},null,{"$f":"IF(ISBLANK(Y7),\"\",IF(VALUE(Y7)>89,1,VLOOKUP(VALUE(Y7),List2!$A$1:'List2'!$B$90,2)))","v":""},null,{"$f":"IF(ISBLANK(AA7),\"\",IF(VALUE(AA7)>89,1,VLOOKUP(VALUE(AA7),List2!$A$1:'List2'!$B$90,2)))","v":""},null,{"$f":"IF(ISBLANK(AC7),\"\",IF(VALUE(AC7)>89,1,VLOOKUP(VALUE(AC7),List2!$A$1:'List2'!$B$90,2)))","v":""},null,{"$f":"IF(ISBLANK(AE7),\"\",IF(VALUE(AE7)>89,1,VLOOKUP(VALUE(AE7),List2!$A$1:'List2'!$B$90,2)))","v":""},null,{"$f":"IF(ISBLANK(AG7),\"\",IF(VALUE(AG7)>89,1,VLOOKUP(VALUE(AG7),List2!$A$1:'List2'!$B$90,2)))","v":""},null,{"$f":"IF(ISBLANK(AI7),\"\",IF(VALUE(AI7)>89,1,VLOOKUP(VALUE(AI7),List2!$A$1:'List2'!$B$90,2)))","v":""},null,{"$f":"IF(ISBLANK(AK7),\"\",IF(VALUE(AK7)>89,1,VLOOKUP(VALUE(AK7),List2!$A$1:'List2'!$B$90,2)))","v":""},null,{"$f":"IF(ISBLANK(AM7),\"\",IF(VALUE(AM7)>89,1,VLOOKUP(VALUE(AM7),List2!$A$1:'List2'!$B$90,2)))","v":""},null,292]
[6,"Martinek Milan",960,960,null,{"$f":"IF(ISBLANK(E8),\"\",IF(VALUE(E8)>89,1,VLOOKUP(VALUE(E8),List2!$A$1:'List2'!$B$90,2)))","v":""},"1",{"$f":"IF(ISBLANK(G8),\"\",IF(VALUE(G8)>89,1,VLOOKUP(VALUE(G8),List2!$A$1:'List2'!$B$90,2)))","v":200},"2",{"$f":"IF(ISBLANK(I8),\"\",IF(VALUE(I8)>89,1,VLOOKUP(VALUE(I8),List2!$A$1:'List2'!$B$90,2)))","v":180},"2",{"$f":"IF(ISBLANK(K8),\"\",IF(VALUE(K8)>89,1,VLOOKUP(VALUE(K8),List2!$A$1:'List2'!$B$90,2)))","v":180},"1",{"$f":"IF(ISBLANK(M8),\"\",IF(VALUE(M8)>89,1,VLOOKUP(VALUE(M8),List2!$A$1:'List2'!$B$90,2)))","v":200},null,{"$f":"IF(ISBLANK(O8),\"\",IF(VALUE(O8)>89,1,VLOOKUP(VALUE(O8),List2!$A$1:'List2'!$B$90,2)))","v":""},"1",{"$f":"IF(ISBLANK(Q8),\"\",IF(VALUE(Q8)>89,1,VLOOKUP(VALUE(Q8),List2!$A$1:'List2'!$B$90,2)))","v":200},null,{"$f":"IF(ISBLANK(S8),\"\",IF(VALUE(S8)>89,1,VLOOKUP(VALUE(S8),List2!$A$1:'List2'!$B$90,2)))","v":""},null,{"$f":"IF(ISBLANK(U8),\"\",IF(VALUE(U8)>89,1,VLOOKUP(VALUE(U8),List2!$A$1:'List2'!$B$90,2)))","v":""},null,{"$f":"IF(ISBLANK(W8),\"\",IF(VALUE(W8)>89,1,VLOOKUP(VALUE(W8),List2!$A$1:'List2'!$B$90,2)))","v":""},null,{"$f":"IF(ISBLANK(Y8),\"\",IF(VALUE(Y8)>89,1,VLOOKUP(VALUE(Y8),List2!$A$1:'List2'!$B$90,2)))","v":""},null,{"$f":"IF(ISBLANK(AA8),\"\",IF(VALUE(AA8)>89,1,VLOOKUP(VALUE(AA8),List2!$A$1:'List2'!$B$90,2)))","v":""},null,{"$f":"IF(ISBLANK(AC8),\"\",IF(VALUE(AC8)>89,1,VLOOKUP(VALUE(AC8),List2!$A$1:'List2'!$B$90,2)))","v":""},null,{"$f":"IF(ISBLANK(AE8),\"\",IF(VALUE(AE8)>89,1,VLOOKUP(VALUE(AE8),List2!$A$1:'List2'!$B$90,2)))","v":""},null,{"$f":"IF(ISBLANK(AG8),\"\",IF(VALUE(AG8)>89,1,VLOOKUP(VALUE(AG8),List2!$A$1:'List2'!$B$90,2)))","v":""},null,{"$f":"IF(ISBLANK(AI8),\"\",IF(VALUE(AI8)>89,1,VLOOKUP(VALUE(AI8),List2!$A$1:'List2'!$B$90,2)))","v":""},null,{"$f":"IF(ISBLANK(AK8),\"\",IF(VALUE(AK8)>89,1,VLOOKUP(VALUE(AK8),List2!$A$1:'List2'!$B$90,2)))","v":""},null,{"$f":"IF(ISBLANK(AM8),\"\",IF(VALUE(AM8)>89,1,VLOOKUP(VALUE(AM8),List2!$A$1:'List2'!$B$90,2)))","v":""},null,960]
[7,"Mader Ivo",872,872,null,{"$f":"IF(ISBLANK(E9),\"\",IF(VALUE(E9)>89,1,VLOOKUP(VALUE(E9),List2!$A$1:'List2'!$B$90,2)))","v":""},"2",{"$f":"IF(ISBLANK(G9),\"\",IF(VALUE(G9)>89,1,VLOOKUP(VALUE(G9),List2!$A$1:'List2'!$B$90,2)))","v":180},"1",{"$f":"IF(ISBLANK(I9),\"\",IF(VALUE(I9)>89,1,VLOOKUP(VALUE(I9),List2!$A$1:'List2'!$B$90,2)))","v":200},null,{"$f":"IF(ISBLANK(K9),\"\",IF(VALUE(K9)>89,1,VLOOKUP(VALUE(K9),List2!$A$1:'List2'!$B$90,2)))","v":""},"4",{"$f":"IF(ISBLANK(M9),\"\",IF(VALUE(M9)>89,1,VLOOKUP(VALUE(M9),List2!$A$1:'List2'!$B$90,2)))","v":162},"12",{"$f":"IF(ISBLANK(O9),\"\",IF(VALUE(O9)>89,1,VLOOKUP(VALUE(O9),List2!$A$1:'List2'!$B$90,2)))","v":130},null,{"$f":"IF(ISBLANK(Q9),\"\",IF(VALUE(Q9)>89,1,VLOOKUP(VALUE(Q9),List2!$A$1:'List2'!$B$90,2)))","v":""},"1",{"$f":"IF(ISBLANK(S9),\"\",IF(VALUE(S9)>89,1,VLOOKUP(VALUE(S9),List2!$A$1:'List2'!$B$90,2)))","v":200},null,{"$f":"IF(ISBLANK(U9),\"\",IF(VALUE(U9)>89,1,VLOOKUP(VALUE(U9),List2!$A$1:'List2'!$B$90,2)))","v":""},null,{"$f":"IF(ISBLANK(W9),\"\",IF(VALUE(W9)>89,1,VLOOKUP(VALUE(W9),List2!$A$1:'List2'!$B$90,2)))","v":""},null,{"$f":"IF(ISBLANK(Y9),\"\",IF(VALUE(Y9)>89,1,VLOOKUP(VALUE(Y9),List2!$A$1:'List2'!$B$90,2)))","v":""},null,{"$f":"IF(ISBLANK(AA9),\"\",IF(VALUE(AA9)>89,1,VLOOKUP(VALUE(AA9),List2!$A$1:'List2'!$B$90,2)))","v":""},null,{"$f":"IF(ISBLANK(AC9),\"\",IF(VALUE(AC9)>89,1,VLOOKUP(VALUE(AC9),List2!$A$1:'List2'!$B$90,2)))","v":""},null,{"$f":"IF(ISBLANK(AE9),\"\",IF(VALUE(AE9)>89,1,VLOOKUP(VALUE(AE9),List2!$A$1:'List2'!$B$90,2)))","v":""},null,{"$f":"IF(ISBLANK(AG9),\"\",IF(VALUE(AG9)>89,1,VLOOKUP(VALUE(AG9),List2!$A$1:'List2'!$B$90,2)))","v":""},null,{"$f":"IF(ISBLANK(AI9),\"\",IF(VALUE(AI9)>89,1,VLOOKUP(VALUE(AI9),List2!$A$1:'List2'!$B$90,2)))","v":""},null,{"$f":"IF(ISBLANK(AK9),\"\",IF(VALUE(AK9)>89,1,VLOOKUP(VALUE(AK9),List2!$A$1:'List2'!$B$90,2)))","v":""},null,{"$f":"IF(ISBLANK(AM9),\"\",IF(VALUE(AM9)>89,1,VLOOKUP(VALUE(AM9),List2!$A$1:'List2'!$B$90,2)))","v":""},null,872]
[8,"Fergl Jaroslav",798,798,null,{"$f":"IF(ISBLANK(E10),\"\",IF(VALUE(E10)>89,1,VLOOKUP(VALUE(E10),List2!$A$1:'List2'!$B$90,2)))","v":""},"5",{"$f":"IF(ISBLANK(G10),\"\",IF(VALUE(G10)>89,1,VLOOKUP(VALUE(G10),List2!$A$1:'List2'!$B$90,2)))","v":156},"8",{"$f":"IF(ISBLANK(I10),\"\",IF(VALUE(I10)>89,1,VLOOKUP(VALUE(I10),List2!$A$1:'List2'!$B$90,2)))","v":144},"4",{"$f":"IF(ISBLANK(K10),\"\",IF(VALUE(K10)>89,1,VLOOKUP(VALUE(K10),List2!$A$1:'List2'!$B$90,2)))","v":162},"2",{"$f":"IF(ISBLANK(M10),\"\",IF(VALUE(M10)>89,1,VLOOKUP(VALUE(M10),List2!$A$1:'List2'!$B$90,2)))","v":180},null,{"$f":"IF(ISBLANK(O10),\"\",IF(VALUE(O10)>89,1,VLOOKUP(VALUE(O10),List2!$A$1:'List2'!$B$90,2)))","v":""},"5",{"$f":"IF(ISBLANK(Q10),\"\",IF(VALUE(Q10)>89,1,VLOOKUP(VALUE(Q10),List2!$A$1:'List2'!$B$90,2)))","v":156},null,{"$f":"IF(ISBLANK(S10),\"\",IF(VALUE(S10)>89,1,VLOOKUP(VALUE(S10),List2!$A$1:'List2'!$B$90,2)))","v":""},null,{"$f":"IF(ISBLANK(U10),\"\",IF(VALUE(U10)>89,1,VLOOKUP(VALUE(U10),List2!$A$1:'List2'!$B$90,2)))","v":""},null,{"$f":"IF(ISBLANK(W10),\"\",IF(VALUE(W10)>89,1,VLOOKUP(VALUE(W10),List2!$A$1:'List2'!$B$90,2)))","v":""},null,{"$f":"IF(ISBLANK(Y10),\"\",IF(VALUE(Y10)>89,1,VLOOKUP(VALUE(Y10),List2!$A$1:'List2'!$B$90,2)))","v":""},null,{"$f":"IF(ISBLANK(AA10),\"\",IF(VALUE(AA10)>89,1,VLOOKUP(VALUE(AA10),List2!$A$1:'List2'!$B$90,2)))","v":""},null,{"$f":"IF(ISBLANK(AC10),\"\",IF(VALUE(AC10)>89,1,VLOOKUP(VALUE(AC10),List2!$A$1:'List2'!$B$90,2)))","v":""},null,{"$f":"IF(ISBLANK(AE10),\"\",IF(VALUE(AE10)>89,1,VLOOKUP(VALUE(AE10),List2!$A$1:'List2'!$B$90,2)))","v":""},null,{"$f":"IF(ISBLANK(AG10),\"\",IF(VALUE(AG10)>89,1,VLOOKUP(VALUE(AG10),List2!$A$1:'List2'!$B$90,2)))","v":""},null,{"$f":"IF(ISBLANK(AI10),\"\",IF(VALUE(AI10)>89,1,VLOOKUP(VALUE(AI10),List2!$A$1:'List2'!$B$90,2)))","v":""},null,{"$f":"IF(ISBLANK(AK10),\"\",IF(VALUE(AK10)>89,1,VLOOKUP(VALUE(AK10),List2!$A$1:'List2'!$B$90,2)))","v":""},null,{"$f":"IF(ISBLANK(AM10),\"\",IF(VALUE(AM10)>89,1,VLOOKUP(VALUE(AM10),List2!$A$1:'List2'!$B$90,2)))","v":""},null,798]
{"$rows_left_out":92}
{"sheet":"List2","index":1,"n_rows":90,"n_cols":2,"rows_kept":90,"cut":false,"hidden":false,"merged":[]}
[1,200]
[2,180]
[3,170]
[4,162]
[5,156]
[6,152]
[7,148]
[8,144]
[9,140]
[10,136]
{"$rows_left_out":81}
{"sheet":"List3","index":2,"n_rows":0,"n_cols":0,"rows_kept":0,"cut":false,"hidden":false,"merged":[]}